Sodium dodecamer

Gas phase ion energetics data

Data compiled by: Sharon G. Lias, Rhoda D. Levin, and Sherif A. Kafafi

Ionization energy determinations

IE (eV) Method Reference
3.6 ± 0.1PIHerrmann, Leutwyler, et al., 1978

References

Herrmann, Leutwyler, et al., 1978
Herrmann, A.; Leutwyler, S.; Schumacher, E.; Woste, L., 38. On metal-atom clusters IV. Photoionization thresholds and multiphoton ionization spectra of alkali-metal molecules, Helv. Chim. Acta, 1978, 61, 453. [all data]