AsH3+

Vibrational and/or electronic energy levels

Data compiled by: Marilyn E. Jacox

State:   A

 Energy
 (cm-1
 Med.   Transition   λmin
 (nm)
 λmax
 (nm)

References

To = 18000 ± 300 gas Potts and Price, 1972

State:   X

Vib.
sym.
 No.   Approximate
 type of mode
 cm-1   Med.   Method   References

a2 2 OPLA 452 ± 25 gas PE PI Potts and Price, 1972
Berkowitz, 1988

Additional references: Jacox, 1994, page 129

Potts and Price, 1972
Potts, A.W.; Price, W.C., Photoelectron spectra and valence shell orbital structures of groups V VI hydrides, Proc. R. Soc. London A:, 1972, 326, 181. [all data]

Berkowitz, 1988
Berkowitz, J., Photoionization mass spectrometric studies of AsHn(n=1-3), J. Chem. Phys., 1988, 89, 7065. [all data]

Jacox, 1994
Jacox, M.E., Vibrational and electronic energy levels of polyatomic transient molecules, American Chemical Society, Washington, DC, 1994, 464. [all data]