Gadolinium, tris(η5-2,4-cyclopentadien-1-yl)-

Phase change data

Data compiled by: William E. Acree, Jr., James S. Chickos

Enthalpy of sublimation

ΔsubH (kJ/mol) Temperature (K) Reference
106.7 ± 2.9513. - 623.Borisov, Krasnova, et al., 1973

References

Borisov, Krasnova, et al., 1973
Borisov, G.K.; Krasnova, S.G.; Devyatykh, G.G., Russ. J. Phys. Chem., 1973, 18, 346. [all data]