Propanoyl ferrocene

Phase change data

Data compiled by: William E. Acree, Jr., James S. Chickos

Quantity Value Units Method Reference Comment
Δvap80.7 ± 0.8kJ/molGSKrol, Druzhinina, et al., 2009
Quantity Value Units Method Reference Comment
Δsub99.0 ± 1.5kJ/molGSKrol, Druzhinina, et al., 2009

Enthalpy of fusion

ΔfusH (kJ/mol) Temperature (K) Method Reference
19.2311.6ACKrol, Druzhinina, et al., 2009
19.7311.6DSCKrol, Druzhinina, et al., 2009

References

Krol, Druzhinina, et al., 2009
Krol, Olesya V.; Druzhinina, Anna I.; Varushchenko, Raisa M.; Reshetova, Marina D.; Borisova, Nataliya E.; Dorofeeva, Olga V.; Troyanov, Sergey I., Heat Capacities and Thermodynamic Functions of Propanoylferrocene and Propylferrocene «8224», J. Chem. Eng. Data, 2009, 54, 2, 263-271, https://doi.org/10.1021/je800266e . [all data]