AlCo10

Gas phase ion energetics data

Data compiled by: John E. Bartmess

Electron affinity determinations

EA (eV) Reference Comment
1.90 ± 0.19Pramann, Nakajima, et al., 2001Vertical Detachment Energy: 2.38±0.11 eV

References

Pramann, Nakajima, et al., 2001
Pramann, A.; Nakajima, A.; Kaya, K., Photoelectron spectroscopy of bimetallic aluminum cobalt cluster anions: Comparison of electronic structure and hydrogen chemisorption rates, J. Chem. Phys., 2001, 115, 12, 5404-5410, https://doi.org/10.1063/1.1394944 . [all data]