HNiOH

Vibrational and/or electronic energy levels

Data compiled by: Marilyn E. Jacox

State:   ?

 Energy
 (cm-1
 Med.   Transition   λmin
 (nm)
 λmax
 (nm)

References

Td Ar 280 360 Park, Hauge, et al., 1988

State:   X

Vib.
sym.
 No.   Approximate
 type of mode
 cm-1   Med.   Method   References

OH stretch 3698.6 Ar IR Park, Hauge, et al., 1988
OH stretch 3688.4 Kr IR Park, Hauge, et al., 1988
NiH stretch 1901.0 Ar IR Park, Hauge, et al., 1988
1837.3 Ar IR Park, Hauge, et al., 1988
NiH stretch 1893.0 Kr IR Park, Hauge, et al., 1988
1830.8 Kr IR Park, Hauge, et al., 1988
NiO stretch 707.0 Ar IR Park, Hauge, et al., 1988
690.6 Ar IR Park, Hauge, et al., 1988
NiO stretch 699.1 Kr IR Park, Hauge, et al., 1988
685.8 Kr IR Park, Hauge, et al., 1988

Additional references: Jacox, 1994, page 136

Park, Hauge, et al., 1988
Park, M.; Hauge, R.H.; Margrave, J.L., High Temp. Sci., 1988, 25, 1. [all data]

Jacox, 1994
Jacox, M.E., Vibrational and electronic energy levels of polyatomic transient molecules, American Chemical Society, Washington, DC, 1994, 464. [all data]