Pd5

Gas phase ion energetics data

Data compiled by: John E. Bartmess

Electron affinity determinations

EA (eV) Method Reference Comment
1.45 ± 0.10LPESGanteför, Gausa, et al., 1990EA: threshold, ≥EA(adiabatic). Vertical Detachment Energy: 1.78±0.1 eV.

References

Ganteför, Gausa, et al., 1990
Ganteför, G.; Gausa, M.; Meiwes-Broer, K.-H.; Lutz, H.O., Photoelectron Spectroscopy of Silver and Palladium Cluster Anions, J. Chem. Soc. Farad. Trans., 1990, 86, 13, 2483, https://doi.org/10.1039/ft9908602483 . [all data]