Disulfide, methyl 1-(1-propenylthio)propyl

Van Den Dool and Kratz RI, non-polar column, temperature ramp

View large format table.

Column type Active phase I Reference Comment
CapillaryUltra-11390.6Farkas, Hradský, et al., 199225. m/0.2 mm/0.33 μm, H2, 2. K/min; Tstart: 60. C; Tend: 230. C
CapillaryHP-11407.Kuo and Ho, 199250. m/0.32 mm/1.05 μm, He, 2. K/min; Tstart: 40. C; Tend: 260. C
CapillaryHP-11407.Kuo, Chien, et al., 199050. m/0.32 mm/1.05 μm, He, 2. K/min; Tstart: 40. C; Tend: 260. C

Van Den Dool and Kratz RI, non-polar column, custom temperature program

View large format table.

Column type Active phase I Reference Comment
CapillaryHP-5MS1436.5Andriamaharavo, 201430. m/0.25 mm/0.25 μm, He; Program: 60C (1 min) => 5 C/min => 210C => 10 C/min => 280C (15 min)

References

Farkas, Hradský, et al., 1992
Farkas, P.; Hradský, P.; Kovác, M., Novel flavour components identified in the steamn distillate of onion (Allium cepa L.), Z. Lebensm. Unters. Forsch., 1992, 195, 5, 459-462, https://doi.org/10.1007/BF01191718 . [all data]

Kuo and Ho, 1992
Kuo, M.-C.; Ho, C.-T., Volatile constituents of the distilled oils of Welsh onions (Allium fistulosum L. variety Maichuon) and scallions (Allium fistulosum L. variety Caespitosum), J. Agric. Food Chem., 1992, 40, 1, 111-117, https://doi.org/10.1021/jf00013a021 . [all data]

Kuo, Chien, et al., 1990
Kuo, M.-C.; Chien, M.; Ho, C.-T., Novel Polysulfides Identified in the Volatile Components from Welsh Onions (Allium fistulosum L. var. maichuon) and Scallions (Allium fistulosum L. var. caespitosum), J. Agric. Food Chem., 1990, 38, 6, 1378-1381, https://doi.org/10.1021/jf00096a017 . [all data]

Andriamaharavo, 2014
Andriamaharavo, N.R., Retention Data. NIST Mass Spectrometry Data Center., NIST Mass Spectrometry Data Center, 2014. [all data]