(.+-.)-3-(nonylthio)-1,2-propanediol

Phase change data

Data compiled by: Thermodynamics Research Center, NIST Boulder Laboratories, Chris Muzny director

Quantity Value Units Method Reference Comment
Tfus303.KN/Avan Doren and van der Geest, 1990Uncertainty assigned by TRC = 1. K

In addition to the Thermodynamics Research Center (TRC) data available from this site, much more physical and chemical property data is available from the following TRC products:

References

van Doren and van der Geest, 1990
van Doren, H.A.; van der Geest, R., A comparative study of the liquid-crystalline behavior of three homologous series of 1,2-propanediol derivatives, Recl.: J. R. Neth. Chem. Soc., 1990, 109, 197. [all data]