3-(Heptylamino)-1,2-propanediol

Phase change data

Data compiled by: William E. Acree, Jr., James S. Chickos

Enthalpy of fusion

ΔfusH (kJ/mol) Temperature (K) Method Reference
28.8324.9DSCAcree, 1993

References

Acree, 1993
Acree, William E., Thermodynamic properties of organic compounds, Thermochimica Acta, 1993, 219, 97-104, https://doi.org/10.1016/0040-6031(93)80486-T . [all data]