HCONHSr

Vibrational and/or electronic energy levels

Data compiled by: Marilyn E. Jacox

State:   C

 Energy
 (cm-1
 Med.   Transition   λmin
 (nm)
 λmax
 (nm)

References

To = 14580 ± 20 gas C-X 655 700 Bopegedera, Fernando, et al., 1990

Vib.
sym.
 No.   Approximate
 type of mode
 cm-1   Med.   Method   References

Sr stretch 315 ± 10 gas LF Bopegedera, Fernando, et al., 1990

State:   B

 Energy
 (cm-1
 Med.   Transition   λmin
 (nm)
 λmax
 (nm)

To = 13917 ± 20 gas B-X 700 750 Bopegedera, Fernando, et al., 1990

Vib.
sym.
 No.   Approximate
 type of mode
 cm-1   Med.   Method   References

Sr stretch 284 ± 10 gas LF Bopegedera, Fernando, et al., 1990

State:   A

 Energy
 (cm-1
 Med.   Transition   λmin
 (nm)
 λmax
 (nm)

To = 13077 ± 20 gas A-X 730 820 Bopegedera, Fernando, et al., 1990

Vib.
sym.
 No.   Approximate
 type of mode
 cm-1   Med.   Method   References

Sr stretch 278 ± 10 gas LF Bopegedera, Fernando, et al., 1990

State:   X

Vib.
sym.
 No.   Approximate
 type of mode
 cm-1   Med.   Method   References

Sr stretch 288 ± 10 gas LF Bopegedera, Fernando, et al., 1990

Additional references: Jacox, 1994, page 326

Bopegedera, Fernando, et al., 1990
Bopegedera, A.M.R.P.; Fernando, W.T.M.L.; Bernath, P.F., Gas-phase inorganic chemistry: laser spectroscopy of calcium and strontium monoformamidates, J. Phys. Chem., 1990, 94, 9, 3547, https://doi.org/10.1021/j100372a035 . [all data]

Jacox, 1994
Jacox, M.E., Vibrational and electronic energy levels of polyatomic transient molecules, American Chemical Society, Washington, DC, 1994, 464. [all data]