2,4,8,10-Tetraoxaspiro[5.5]undecane

Condensed phase thermochemistry data

Data compiled by: Hussein Y. Afeefy, Joel F. Liebman, and Stephen E. Stein

Quantity Value Units Method Reference Comment
Δcsolid-3767.kJ/molCcbFletcher, Mortimer, et al., 1959Corresponding Δfsolid = -702.1 kJ/mol (simple calculation by NIST; no Washburn corrections)

Phase change data

Data compiled as indicated in comments:
BS - Robert L. Brown and Stephen E. Stein
ALS - Hussein Y. Afeefy, Joel F. Liebman, and Stephen E. Stein

Quantity Value Units Method Reference Comment
Δsub73. ± 2.kJ/molVFletcher, Mortimer, et al., 1959ALS

Reduced pressure boiling point

Tboil (K) Pressure (bar) Reference Comment
354.70.001Aldrich Chemical Company Inc., 1990BS

References

Fletcher, Mortimer, et al., 1959
Fletcher, S.E.; Mortimer, C.T.; Springall, H.D., Heats of combustion and molecular structure. Part VII. 1:3-dioxa- and 1:3:5-trioxa-cycloalkanes, J. Chem. Soc., 1959, 580-584. [all data]

Aldrich Chemical Company Inc., 1990
Aldrich Chemical Company Inc., Catalog Handbook of Fine Chemicals, Aldrich Chemical Company, Inc., Milwaukee WI, 1990, 1. [all data]