Vanadium, (η7-cycloheptatrienylium)(η5-2,4-cyclopentadien-1-yl)-

Gas phase ion energetics data

Data compiled as indicated in comments:
LLK - Sharon G. Lias, Rhoda D. Levin, and Sherif A. Kafafi
RDSH - Henry M. Rosenstock, Keith Draxl, Bruce W. Steiner, and John T. Herron

Ionization energy determinations

IE (eV) Method Reference Comment
7.2 ± 0.1EIMuller and Goser, 1968RDSH
6.42 ± 0.05PEEvans, Green, et al., 1974Vertical value; LLK

Appearance energy determinations

Ion AE (eV) Other Products MethodReferenceComment
C5H5V+9.2 ± 0.8?EIMuller and Goser, 1968RDSH
C6H6V+11.0 ± 0.2?EIMuller and Goser, 1968RDSH
V+13.8 ± 0.3?EIMuller and Goser, 1968RDSH

References

Muller and Goser, 1968
Muller, J.; Goser, P., Massenspektroskopische Untersuchungen an Ubergangsmetall-π-Komplexen mit funf-, sechs- und siebengliedrigen aromatischen Ringliganden, J. Organometal. Chem., 1968, 12, 163. [all data]

Evans, Green, et al., 1974
Evans, S.; Green, J.C.; Jackson, S.E.; Higginson, B., He(I) photoelectron spectra of some transition-metal sandwich complexes, J. Chem. Soc. Dalton Trans., 1974, 304. [all data]