Carbon monoboride monosilicide

Gas phase ion energetics data

Data compiled by: Henry M. Rosenstock, Keith Draxl, Bruce W. Steiner, and John T. Herron

Ionization energy determinations

IE (eV) Method Reference
9.9EIVerhaegen, Stafford, et al., 1964

References

Verhaegen, Stafford, et al., 1964
Verhaegen, G.; Stafford, F.E.; Drowart, J., Mass spectrometric study of the systems boron-carbon and boron-carbon-silicon, J. Chem. Phys., 1964, 40, 1622. [all data]