8-Pentadecyltheophylline

Phase change data

Data compiled by: William E. Acree, Jr., James S. Chickos

Enthalpy of fusion

ΔfusH (kJ/mol) Temperature (K) Method Reference Comment
27.2413.7DSCAcree, 1991See also Gondová, Králik, et al., 1989.

References

Acree, 1991
Acree, William E., Thermodynamic properties of organic compounds: enthalpy of fusion and melting point temperature compilation, Thermochimica Acta, 1991, 189, 1, 37-56, https://doi.org/10.1016/0040-6031(91)87098-H . [all data]

Gondová, Králik, et al., 1989
Gondová, T.; Králik, P.; Gonda, J., Determination of some thermodynamic characteristics of melting of 8-alkyltheophyllines by the DSC method, Thermochimica Acta, 1989, 156, 1, 147-155, https://doi.org/10.1016/0040-6031(89)87180-1 . [all data]