Butonate

Gas phase ion energetics data

Data compiled by: Sharon G. Lias, Rhoda D. Levin, and Sherif A. Kafafi

Ionization energy determinations

IE (eV) Method Reference Comment
10.3PEBetteridge, Thompson, et al., 1972Vertical value

References

Betteridge, Thompson, et al., 1972
Betteridge, D.; Thompson, M.; Baker, A.D.; Kemp, N.R., Photoelectron spectra of phosphorus halides, alkyl phosphites and phosphates, organophosphorus pesticides, and related compounds, Anal. Chem., 1972, 44, 2005. [all data]