Tetraborane(8), N,N-dimethylaminodifluorophosphine-p-

Gas phase ion energetics data

Data compiled by: Sharon G. Lias, Rhoda D. Levin, and Sherif A. Kafafi

Ionization energy determinations

IE (eV) Method Reference
9.6 ± 0.3EIPaine, Sodeck, et al., 1972

Appearance energy determinations

Ion AE (eV) Other Products MethodReferenceComment
B4C2H12NF2P+10.0 ± 0.3?EIPaine, Sodeck, et al., 1972

References

Paine, Sodeck, et al., 1972
Paine, R.T.; Sodeck, G.; Stafford, F.E., Molecular beam mass spectra and pyrolyses of fluorophosphine-triborane(7) complexes. Formation and mass spectrum of triborane(7), Inorg. Chem., 1972, 11, 2593. [all data]