Zinc dimer

Gas phase ion energetics data

Data compiled by: Sharon G. Lias and Joel F. Liebman

Ionization energy determinations

IE (eV) Method Reference
9.0 ± 0.2IMBBuckner, Gord, et al., 1988

References

Buckner, Gord, et al., 1988
Buckner, S.W.; Gord, J.R.; Freiser, B.S., Gas phase studies of Zn2, Ag3, and Ag5., J. Chem. Phys., 1988, 88, 3678. [all data]