Sn2

Gas phase ion energetics data

Data compiled by: John E. Bartmess

Electron affinity determinations

EA (eV) Method Reference Comment
1.965 ± 0.010LPESMoravec, Klopcic, et al., 1999
1.962 ± 0.010LPESHo, Polak, et al., 1992
1.70 ± 0.20LPESGanteför, Gausa, et al., 1989

References

Moravec, Klopcic, et al., 1999
Moravec, V.D.; Klopcic, S.A.; Jarrold, C.C., Anion photoelectron spectroscopy of small tin clusters, J. Chem. Phys., 1999, 110, 11, 5079-5088, https://doi.org/10.1063/1.478405 . [all data]

Ho, Polak, et al., 1992
Ho, J.; Polak, M.L.; Lineberger, W.C., Photoelectron Spectroscopy of Group-IV Heavy Metal Dimers - Sn2-, Pb2-, and SnPb-, J. Chem. Phys., 1992, 96, 1, 144, https://doi.org/10.1063/1.462503 . [all data]

Ganteför, Gausa, et al., 1989
Ganteför, G.; Gausa, M.; Meiwes-Broer, K.H.; Lutz, H.O., Photoemission from Tin and Lead Clusters Anions, Z. Phys. D, 1989, 14, 1-4, 405, https://doi.org/10.1007/BF01426983 . [all data]