Sulfur trimer

Gas phase thermochemistry data

Quantity Value Units Method Reference Comment
gas,1 bar269.52J/mol*KReviewChase, 1998Data last reviewed in September, 1977

Gas Phase Heat Capacity (Shomate Equation)

Cp° = A + B*t + C*t2 + D*t3 + E/t2
H° − H°298.15= A*t + B*t2/2 + C*t3/3 + D*t4/4 − E/t + F − H
S° = A*ln(t) + B*t + C*t2/2 + D*t3/3 − E/(2*t2) + G
    Cp = heat capacity (J/mol*K)
    H° = standard enthalpy (kJ/mol)
    S° = standard entropy (J/mol*K)
    t = temperature (K) / 1000.

View plot Requires a JavaScript / HTML 5 canvas capable browser.

View table.

Temperature (K) 298. - 6000.
A 53.78072
B 4.351569
C -0.000003
D -0.000005
E -0.650185
F -18.40881
G 329.6465
H 0.000000
ReferenceChase, 1998
Comment Data last reviewed in September, 1977

References

Chase, 1998
Chase, M.W., Jr., NIST-JANAF Themochemical Tables, Fourth Edition, J. Phys. Chem. Ref. Data, Monograph 9, 1998, 1-1951. [all data]