Calcium

Gas phase thermochemistry data

Quantity Value Units Method Reference Comment
Δfgas81.654kcal/molReviewChase, 1998Data last reviewed in September, 1983
Quantity Value Units Method Reference Comment
gas,1 bar61.470cal/mol*KReviewChase, 1998Data last reviewed in September, 1983

Gas Phase Heat Capacity (Shomate Equation)

Cp° = A + B*t + C*t2 + D*t3 + E/t2
H° − H°298.15= A*t + B*t2/2 + C*t3/3 + D*t4/4 − E/t + F − H
S° = A*ln(t) + B*t + C*t2/2 + D*t3/3 − E/(2*t2) + G
    Cp = heat capacity (cal/mol*K)
    H° = standard enthalpy (kcal/mol)
    S° = standard entropy (cal/mol*K)
    t = temperature (K) / 1000.

View plot Requires a JavaScript / HTML 5 canvas capable browser.

View table.

Temperature (K) 298. - 1000.1000. - 6000.
A 14.432205.439922
B -26.22591-0.364820
C 27.026410.076231
D -9.773571-0.000716
E -0.0008420.298975
F 78.2943181.19469
G 85.6349070.14011
H 81.6533081.65330
ReferenceChase, 1998Chase, 1998
Comment Data last reviewed in September, 1983 Data last reviewed in September, 1983

Constants of diatomic molecules

Data compiled by: Klaus P. Huber and Gerhard H. Herzberg

Data collected through July, 1976

Symbols used in the table of constants
SymbolMeaning
State electronic state and / or symmetry symbol
Te minimum electronic energy (cm-1)
ωe vibrational constant – first term (cm-1)
ωexe vibrational constant – second term (cm-1)
ωeye vibrational constant – third term (cm-1)
Be rotational constant in equilibrium position (cm-1)
αe rotational constant – first term (cm-1)
γe rotation-vibration interaction constant (cm-1)
De centrifugal distortion constant (cm-1)
βe rotational constant – first term, centrifugal force (cm-1)
re internuclear distance (Å)
Trans. observed transition(s) corresponding to electronic state
ν00 position of 0-0 band (units noted in table)
Diatomic constants for 40Ca2
StateTeωeωexeωeyeBeαeγeDeβereTrans.ν00
A band system in the region 16100 - 16900 cm-1 and assigned to Ca2 by Kovalenok and Sokolov, 1967 is in all probability the same as that usually ascribed to CaO. 1
Emission continuum from 19500 to 25000 cm-1.
Hamada, 1931
A 1Σu+ ≤18963.7 ≥136.66 2 Z 0.7166 3  ≥0.058247 2 0.0003104 4  4.59E-08 5  ≤3.8058 A ← X 6 V 18999.7 7 Z
Weniger, 1966; missing citation
X 1Σg+ 0 64.928 Z 1.0651 0.00259 0.046113 0.0007028 -7.35E-06 9.52E-08 8  4.2773

References

Chase, 1998
Chase, M.W., Jr., NIST-JANAF Themochemical Tables, Fourth Edition, J. Phys. Chem. Ref. Data, Monograph 9, 1998, 1-1951. [all data]

Kovalenok and Sokolov, 1967
Kovalenok, G.V.; Sokolov, V.A., Quantum vibration analysis of the orange band of Ca2, Izv. Sib. Otd. Akad. Nauk SSSR, Ser. Khim. Nauk, 1967, 4, 118. [all data]

Hamada, 1931
Hamada, H., III. On the molecular spectra of mercury, zinc, cadmium, magnesium, and thallium, Philos. Mag., 1931, 12, 50. [all data]

Weniger, 1966
Weniger, S., L'elargissement de la raie 4226,73 Å(432 λSo-4P1 1P1o) de ca i dans les spectres de laboratoire et dans les etoiles d M in Proceedings IAU Colloquim on Late-Type Stars, Trieste, M. Hack, ed(s)., 1966, 25-34. [all data]

Balfour and Whitlock, 1975
Balfour, W.J.; Whitlock, R.F., The visible absorption spectrum of diatomic calcium, Can. J. Phys., 1975, 53, 472. [all data]