Bismuth trimer

Gas phase ion energetics data

Data compiled as indicated in comments:
LLK - Sharon G. Lias, Rhoda D. Levin, and Sherif A. Kafafi
B - John E. Bartmess

Electron affinity determinations

EA (eV) Method Reference Comment
1.51 ± 0.10LPESSun, Sun, et al., 2009B
1.600 ± 0.030LPESPolak, Ho, et al., 1991B

Ionization energy determinations

IE (eV) Method Reference Comment
8.8 ± 0.5EIWagner and Grimley, 1974LLK

References

Sun, Sun, et al., 2009
Sun, Z.; Sun, S.T.; Liu, H.T.; Zhu, Q.H.; Gao, Z.; Tang, Z.C., Photoelectron Spectroscopic and Theoretical Studies of MmC6F5 Anionic Complexes (M = Ph and Bi; m=1-4), J. Phys. Chem. A, 2009, 113, 28, 8045-8054, https://doi.org/10.1021/jp8099626 . [all data]

Polak, Ho, et al., 1991
Polak, M.L.; Ho, J.; Gerber, G.; Lineberger, W.C., Photoelectron Spectroscopy of Negatively Charged Bismuth Clusters: Bi2-, Bi3-, and Bi4-, J. Chem. Phys., 1991, 95, 5, 3053, https://doi.org/10.1063/1.460862 . [all data]

Wagner and Grimley, 1974
Wagner, L.C.; Grimley, R.T., A mass spectrometric study of the bismuth vapor system by the angular distribution technique, Chem. Phys. Lett., 1974, 29, 594. [all data]