(R)-linden ether

Normal alkane RI, non-polar column, custom temperature program

View large format table.

Column type Active phase I Reference Comment
CapillaryRTX-11235.ChromTech Pty Ltd, 2006Program: not specified
CapillaryOV-1011235.Acree and Arn, 1997Program: not specified
CapillarySE-541252.Blank, Fischer, et al., 198930. m/0.32 mm/0.3 μm, He; Program: 35C(2min) => 40C/min => 50C(2min) => 6C/min => 230C(10min)
CapillarySE-541252.Blank, Fischer, et al., 198930. m/0.32 mm/0.3 μm, He; Program: 35C(2min) => 40C/min => 50C(2min) => 6C/min => 230C(10min)

References

ChromTech Pty Ltd, 2006
ChromTech Pty Ltd, Retention Data: Rtx-1, Rtx-5, Rtx-50, Rtx-Stab Kovats RI, 2006, retrieved from http://www.chromtech.net.au/pdf/RI-Flavors-20M.pdf. [all data]

Acree and Arn, 1997
Acree, T.; Arn, H., Cornell University Flavornet, 1997, retrieved from http://www.flavornet.org/flavornet.html. [all data]

Blank, Fischer, et al., 1989
Blank, I.; Fischer, K.-H.; Grosch, W., Intensive neutral odourants of linden honey, Z. Lebensm. Unters. Forsch., 1989, 189, 5, 426-433, https://doi.org/10.1007/BF01028316 . [all data]