2,8,14,20-Tetramethyl-4,6,10,12,16,18,20,24-octahydroxyresorci[4]arene (calix[4]resorcinarene)

Phase change data

Data compiled by: William E. Acree, Jr., James S. Chickos

Enthalpy of fusion

ΔfusH (kJ/mol) Temperature (K) Method Reference
38.2578.6DSCFranco, Salamanca, et al., 2010

References

Franco, Salamanca, et al., 2010
Franco, Lina S.; Salamanca, Yina P.; Maldonado, Mauricio; Vargas, Edgar F., Solubility of Calix[4]resorcinarene in Water from (278.15 to 308.15) K, J. Chem. Eng. Data, 2010, 55, 2, 1042-1044, https://doi.org/10.1021/je9005097 . [all data]