1-[Bromo(4-methylphenyl)methyl]pyridinium

Gas phase ion energetics data

Data compiled by: Sharon G. Lias and Joel F. Liebman

Appearance energy determinations

Ion AE (eV) Other Products MethodReferenceComment
C8H8Br+[CH3C6H4CHBr+]1.20 ± 0.35C5H5NCADKatritzky, Watson, et al., 1990

References

Katritzky, Watson, et al., 1990
Katritzky, A.R.; Watson, C.H.; Dega-Szafran, Z.; Eyler, J.R., Collisionally activated dissociation of N-alkylpyridinium cations to pyridine and alkyl cations in the gas phase, J. Am. Chem. Soc., 1990, 112, 2471. [all data]