Naphth[2,3-b]oxiren-2(1aH)-one, 7,7a-dihydro-7-hydroxy-1a,7,7a-trimethyl-

Reaction thermochemistry data

Data compiled by: Hussein Y. Afeefy, Joel F. Liebman, and Stephen E. Stein

Individual Reactions

C13H14O + Oxygen = Naphth[2,3-b]oxiren-2(1aH)-one, 7,7a-dihydro-7-hydroxy-1a,7,7a-trimethyl-

By formula: C13H14O + O2 = C13H14O3

Quantity Value Units Method Reference Comment
Δr-53.14kcal/molCmArnett, Dowd, et al., 1992liquid phase; solvent: THF

References

Arnett, Dowd, et al., 1992
Arnett, E.M.; Dowd, P.; Flowers, R.A., II; Ham, S.W.; Naganathan, S., Thermochemical confirmation of the mechanism of action of vitamin K, J. Am. Chem. Soc., 1992, 114, 9209-9210. [all data]