Monoyttrium tetracarbide

Gas phase ion energetics data

Data compiled by: Henry M. Rosenstock, Keith Draxl, Bruce W. Steiner, and John T. Herron

Ionization energy determinations

IE (eV) Method Reference
7.0 ± 0.3EIKohl and Stearns, 1970

References

Kohl and Stearns, 1970
Kohl, F.J.; Stearns, C.A., Vaporization thermodynamics of yttrium dicarbide-carbon system and dissociation energy of yttrium dicarbide and tetracarbide, J. Chem. Phys., 1970, 52, 6310. [all data]