Scandium tetracarbide

Gas phase ion energetics data

Data compiled as indicated in comments:
LLK - Sharon G. Lias, Rhoda D. Levin, and Sherif A. Kafafi

Ionization energy determinations

IE (eV) Method Reference Comment
6.7 ± 1.0EIHaque and Gingerich, 1981LLK

References

Haque and Gingerich, 1981
Haque, R.; Gingerich, K.A., Identification and atomization energies of gaseous molecules ScC2, ScC3, ScC4, ScC5, and ScC6 by high temperature mass spectrometry, J. Chem. Phys., 1981, 74, 6407. [all data]