Butabarbital

Normal alkane RI, non-polar column, temperature ramp

Data compiled by: NIST Mass Spectrometry Data Center, William E. Wallace, director

Column type CapillaryCapillaryCapillaryPackedPacked
Active phase BP-1DB-1DB-1SE-30SE-30
Column length (m)  10.15.2.2.
Carrier gas  HeHeNitrogenN2
Substrate    Chromosorb W AW DMS (80-100 mesh)Chromosorb W AW DMS
Column diameter (mm)  0.530.25
Phase thickness (μm)  2.650.25
Tstart (C) 100.130.130.130.130.
Tend (C) 300.230.290.290.290.
Heat rate (K/min)  5.10.8.8.
Initial hold (min)   1.2.2.
Final hold (min)   10.8.8.
I 1635.1624.1640.1660.1660.
ReferenceMHA, 9999Anderson and Fuller, 1987Sharp, 1987Peel and Perrigo, 1976Peel and Perrigo, 1975
Comment MSDC-RI MSDC-RI MSDC-RI MSDC-RI MSDC-RI

References

MHA, 9999
MHA, Directorate of ForensicScience., Forensic Toxicology, 9999. [all data]

Anderson and Fuller, 1987
Anderson, W.H.; Fuller, D.C., A simplified procedure for the isolation, characterization, and identification of weak acid and neutral drugs from whole blood, J. Anal. Toxicol., 1987, 11, 5, 198-204, https://doi.org/10.1093/jat/11.5.198 . [all data]

Sharp, 1987
Sharp, M.E., A rapid screening procedure for acidic and neutral drugs in blood by high resolution gas chromatography, J. Anal. Toxicol., 1987, 11, 1, 8-11, https://doi.org/10.1093/jat/11.1.8 . [all data]

Peel and Perrigo, 1976
Peel, H.W.; Perrigo, B., A practical gas chromatographic screening procedure for toxicological analysis, Can. Soc. Forens. Sci. J., 1976, 9, 2, 69-74, https://doi.org/10.1080/00085030.1976.10757247 . [all data]

Peel and Perrigo, 1975
Peel, H.W.; Perrigo, B., A practical gas chromatographic screening procedure for toxicological analysis, Can.Soc.Forens.Sci.J., 1975, 9, 2, 69-74, https://doi.org/10.1080/00085030.1976.10757247 . [all data]