3,4-Diethyl-3,4-dimethoxyhexane

Gas phase thermochemistry data

Data compiled by: Hussein Y. Afeefy, Joel F. Liebman, and Stephen E. Stein

Quantity Value Units Method Reference Comment
Δfgas-122.4 ± 0.7kcal/molCcbDogan, Beckhaus, et al., 1990

Condensed phase thermochemistry data

Data compiled by: Hussein Y. Afeefy, Joel F. Liebman, and Stephen E. Stein

Quantity Value Units Method Reference Comment
Δcliquid-1880.1 ± 0.6kcal/molCcbDogan, Beckhaus, et al., 1990Corresponding Δfliquid = -136.6 kcal/mol (simple calculation by NIST; no Washburn corrections)

Phase change data

Data compiled by: Hussein Y. Afeefy, Joel F. Liebman, and Stephen E. Stein

Enthalpy of vaporization

ΔvapH (kcal/mol) Temperature (K) Method Reference
14.3 ± 0.3302.2VDogan, Beckhaus, et al., 1990

References

Dogan, Beckhaus, et al., 1990
Dogan, B.; Beckhaus, H.D.; Birkhofer, H.; Ruechardt, C., Effects of substituents on the strength of carbon-carbon bonds. 8. Heats of formation and strain of 1,1,2,2-tetraethylethylene glycol dimethyl ether and D,L-1,2-diphenylethylene glycol dimethyl ether, Chem. Ber., 1990, 123, 1365-1368. [all data]