Diboron carbide

Gas phase ion energetics data

Data compiled by: Henry M. Rosenstock, Keith Draxl, Bruce W. Steiner, and John T. Herron

Ionization energy determinations

IE (eV) Method Reference
10.7EIVerhaegen, Stafford, et al., 1964
10.2 ± 0.6EIVerhaegen, Stafford, et al., 1962

References

Verhaegen, Stafford, et al., 1964
Verhaegen, G.; Stafford, F.E.; Drowart, J., Mass spectrometric study of the systems boron-carbon and boron-carbon-silicon, J. Chem. Phys., 1964, 40, 1622. [all data]

Verhaegen, Stafford, et al., 1962
Verhaegen, G.; Stafford, F.E.; Ackerman, M.; Drowart, J., Mass spectrometric investigation of gaseous species in the system boron-carbon, Nature, 1962, 193, 1280. [all data]