CH3OSiH=CH2

Vibrational and/or electronic energy levels

Data compiled by: Marilyn E. Jacox

State:   ?

 Energy
 (cm-1
 Med.   Transition   λmin
 (nm)
 λmax
 (nm)

References

Txd = 40800 Ar Maier, Reisenauer, et al., 1989

State:   X

Vib.
sym.
 No.   Approximate
 type of mode
 cm-1   Med.   Method   References

SiH stretch 2241.9 m Ar IR Maier, Reisenauer, et al., 1989
1464.2 w Ar IR Maier, Reisenauer, et al., 1989
1462.3 w m Ar IR Maier, Reisenauer, et al., 1989
1318.1 w m Ar IR Maier, Reisenauer, et al., 1989
1199.0 w Ar IR Maier, Reisenauer, et al., 1989
1119.0 m Ar IR Maier, Reisenauer, et al., 1989
1100.2 vs Ar IR Maier, Reisenauer, et al., 1989
1002.5 w m Ar IR Maier, Reisenauer, et al., 1989
862.5 s Ar IR Maier, Reisenauer, et al., 1989
752.1 w Ar IR Maier, Reisenauer, et al., 1989
671.1 m Ar IR Maier, Reisenauer, et al., 1989
561.8 w m Ar IR Maier, Reisenauer, et al., 1989

Additional references: Jacox, 1994, page 417

Maier, Reisenauer, et al., 1989
Maier, G.; Reisenauer, H.P.; Schottler, K.; Wessolek-Kraus, U., Hetero-π-Systeme, J. Organomet. Chem., 1989, 366, 1-2, 25, https://doi.org/10.1016/0022-328X(89)87312-7 . [all data]

Jacox, 1994
Jacox, M.E., Vibrational and electronic energy levels of polyatomic transient molecules, American Chemical Society, Washington, DC, 1994, 464. [all data]