(1R,2R,4S,6S,7S,8S)-8-Isopropyl-1-methyl-3-methylenetricyclo[4.4.0.02,7]decan-4-ol

Normal alkane RI, non-polar column, temperature ramp

Data compiled by: NIST Mass Spectrometry Data Center, William E. Wallace, director

Column type CapillaryCapillaryCapillaryCapillaryCapillary
Active phase HP-5DB-5 MSZB-1DB-5 MSHP-5 MS
Column length (m) 30.30.30.30.30.
Carrier gas HydrogenHeliumNitrogenHeliumHelium
Substrate
Column diameter (mm) 0.250.250.250.250.32
Phase thickness (μm) 0.250.250.250.250.25
Tstart (C) 70.60.45.50.60.
Tend (C) 290.240.230.300.280.
Heat rate (K/min) 5.3.3.5.4.
Initial hold (min)    5.5.
Final hold (min)    5.
I 1595.1585.1572.1589.1590.
ReferenceRadulovic, Dordevic, et al., 2010Silva, Pott, et al., 2010Mierendorff, Stahl-Biskup, et al., 2008Noudogbessi, Yedomonhan, et al., 2008Capetanos, Saroglou, et al., 2007
Comment MSDC-RI MSDC-RI MSDC-RI MSDC-RI MSDC-RI
Column type CapillaryCapillaryCapillaryCapillaryCapillary
Active phase DB-5DB-5CP Sil 8 CBDB-5HP-5MS
Column length (m) 30.30.30.30.30.
Carrier gas HeHeHeHeHe
Substrate
Column diameter (mm) 0.250.250.250.250.25
Phase thickness (μm) 0.250.250.250.250.25
Tstart (C) 60.60.80.60.60.
Tend (C) 240.240.200.220.275.
Heat rate (K/min) 3.3.3.4.4.
Initial hold (min)   5.5.
Final hold (min)   5.
I 1587.1589.1594.1591.1588.
ReferenceChaverri and Cicció, 2005Chaverri and Cicció, 2005Facey, Porter, et al., 2005Morteza-Semnani, Akbarzadeh, et al., 2005Sajjadi and Ghannadi, 2005
Comment MSDC-RI MSDC-RI MSDC-RI MSDC-RI MSDC-RI
Column type CapillaryCapillaryCapillaryCapillaryCapillary
Active phase DB-5MSZB-1DB-5SE-30CP Sil 5 CB
Column length (m) 30.30.30.50.25.
Carrier gas HeN2HeHeHe
Substrate
Column diameter (mm) 0.250.250.250.250.25
Phase thickness (μm) 0.250.250.250.25
Tstart (C) 60.45.60.70.60.
Tend (C) 240.230.240.240.220.
Heat rate (K/min) 3.3.3.4.5.
Initial hold (min)
Final hold (min)
I 1586.1572.1586.1581.1575.
ReferenceMaia, Taveira, et al., 2003Mierendorff, Stahl-Biskup, et al., 2003da Silva, Luz, et al., 2003Iñigo, Palá-Paúl, et al., 2002Monfared, Davarani, et al., 2002
Comment MSDC-RI MSDC-RI MSDC-RI MSDC-RI MSDC-RI
Column type CapillaryCapillary
Active phase HP-5SE-30
Column length (m) 30.40.
Carrier gas N2He
Substrate
Column diameter (mm) 0.250.50
Phase thickness (μm) 0.250.75
Tstart (C) 60.30.
Tend (C) 220.220.
Heat rate (K/min) 5.3.
Initial hold (min) 10.
Final hold (min)
I 1586.1575.
ReferenceGallori, Flamini, et al., 2001de Pooter, de Buyck, et al., 1989
Comment MSDC-RI MSDC-RI

Normal alkane RI, non-polar column, custom temperature program

Data compiled by: NIST Mass Spectrometry Data Center, William E. Wallace, director

Column type CapillaryCapillaryCapillaryCapillary
Active phase HP-5DB-5 MSHP-1DB-5
Column length (m) 30.30.30.30.
Carrier gas Nitrogen HeHe
Substrate
Column diameter (mm) 0.350.250.20.25
Phase thickness (μm) 0.250.250.330.25
Program 60 0C 3 0C/min -> 210 0C 5 0C/min -> 250 0C (2 min)80 0C (1.5 min) 4 pC/min -> 180 0C 10 0C/min -> 300 0C (10 min)60C(5min) => 3C/min => 180C => 20C/min => 280C(10min)35C => 4C/min => 180C => 20C/min => 280C
I 1595.1591.1584.1556.
ReferenceVeres, Csupor-Loffler, et al., 2012Silva, Doria, et al., 2008Merle, Verdeguer, et al., 2007Viana, Andrade-Neto, et al., 2002
Comment MSDC-RI MSDC-RI MSDC-RI MSDC-RI

Van Den Dool and Kratz RI, polar column, temperature ramp

Data compiled by: NIST Mass Spectrometry Data Center, William E. Wallace, director

Column type Capillary
Active phase RTX-Wax
Column length (m) 60.
Carrier gas He
Substrate
Column diameter (mm) 0.22
Phase thickness (μm) 0.25
Tstart (C) 60.
Tend (C) 230.
Heat rate (K/min) 2.
Initial hold (min)
Final hold (min) 45.
I 2141.
ReferenceCavalli, Tomi, et al., 2003
Comment MSDC-RI

References

Radulovic, Dordevic, et al., 2010
Radulovic, N.S.; Dordevic, N.D.; Palic, R.M., Volatiles of Pleurospermum austriacum (L.) Hoffm. (Apiaceae), J. Serbian Chem. Soc., 2010, 75, 12, 1-11, https://doi.org/10.2298/JSC100323127R . [all data]

Silva, Pott, et al., 2010
Silva, D.B.; Pott, A.; Oliveira, D.C.R., Analyses of the headspace volatile constituents of aerial parts (leaves and stems), flowers and fruits of Bidens gardneri Bak. and Bidens sulphurea (Cav.) Sch. Bip. using solid-phase microextraction, J. Essen. Oil Res., 2010, 22, 6, 560-563, https://doi.org/10.1080/10412905.2010.9700400 . [all data]

Mierendorff, Stahl-Biskup, et al., 2008
Mierendorff, H.-G.; Stahl-Biskup, E.; Posthumus, M.A.; van Beek, T.A., Composition of commercial Cape chamomile oil (Eriocephalus punctuatus / Eriocephalus tenuifolius), 2008, retrieved from http://www.chemische-analysen-hamburg.de/Publikationen?CapeChamomileOil/. [all data]

Noudogbessi, Yedomonhan, et al., 2008
Noudogbessi, J.-P.; Yedomonhan, P.; Sohounhloue, D.C.K.; Chalchat, J.-C.; Figueredo, G., Chemical composition of essential oil of syzygium guineense (Willd.) DC. var. guineense (Myrtaceae) from Benin, Rec. Nat. Prod., 2008, 33-38. [all data]

Capetanos, Saroglou, et al., 2007
Capetanos, C.; Saroglou, V.; Marin, P.D.; Simic, A.; Skaltsa, H.D., Essential oil snalysis of two endemic Eringium species from Serbia, J. Serb. Chem. Soc., 2007, 72, 10, 961-965, https://doi.org/10.2298/JSC0710961C . [all data]

Chaverri and Cicció, 2005
Chaverri, C.; Cicció, J.F., Essential oil of trees of the genus Ocotea (Lauraceae) in Costa Rica. I. Ocotea brenesii, Rev. Biol. Trop., 2005, 53, 3-4, 431-436, https://doi.org/10.15517/rbt.v53i3-4.14611 . [all data]

Facey, Porter, et al., 2005
Facey, P.C.; Porter, R.B.R.; Reese, P.B.; Williams, L.A.D., Biological activity and chemical composition of the essential oil from Jamaican Hyptis verticillata Jacq., J. Agric. Food Chem., 2005, 53, 12, 4774-4777, https://doi.org/10.1021/jf050008y . [all data]

Morteza-Semnani, Akbarzadeh, et al., 2005
Morteza-Semnani, K.; Akbarzadeh, M.; Rostami, B., The essential oil composition of Teucrium chamaedrys L. from Iran, Flavour Fragr. J., 2005, 20, 5, 544-546, https://doi.org/10.1002/ffj.1479 . [all data]

Sajjadi and Ghannadi, 2005
Sajjadi, S.-E.; Ghannadi, A., Essential oil of the Persian sage, Salvia rhytidea Benth., Acta Pharm. Sin., 2005, 55, 321-326. [all data]

Maia, Taveira, et al., 2003
Maia, J.G.S.; Taveira, F.S.N.; Andrade, E.H.A.; da Silva, M.H.L.; Zoghbi, M.G.B., Essential oils of Lippia grandis Schau., Flavour Fragr. J., 2003, 18, 5, 417-420, https://doi.org/10.1002/ffj.1241 . [all data]

Mierendorff, Stahl-Biskup, et al., 2003
Mierendorff, H.-G.; Stahl-Biskup, E.; Posthumus, M.A.; van Beek, T.A., Composition of commercial Cape chamomile oil (Eriocephalus punctulatus), Flavour Fragr. J., 2003, 18, 6, 510-514, https://doi.org/10.1002/ffj.1259 . [all data]

da Silva, Luz, et al., 2003
da Silva, J.D.; Luz, A.I.R.; da Silva, M.H.L.; Andrade, E.H.A.; Soghbi, M.G.B.; Maia, J.G.S., Essential oils of the leaves and stems of four Psidium spp., Flavour Fragr. J., 2003, 18, 3, 240-243, https://doi.org/10.1002/ffj.1219 . [all data]

Iñigo, Palá-Paúl, et al., 2002
Iñigo, A.; Palá-Paúl, J.; Pérez-Alonso, M.J.; Velasco-Negueruela, A., Essential oil composition from the aerial parts of Haplophyllum linifolium (L.) G. Don fil., Botanica Complutensis, 2002, 26, 79-83. [all data]

Monfared, Davarani, et al., 2002
Monfared, A.; Davarani, S.S.H.; Rustaiyan, A.; Masoudi, S., Composition of the essential oil of Tanacetum balsamita L. ssp. balsamitoides (Schultz Bip.) Grierson from Iran, J. Essent. Oil Res., 2002, 14, 1, 1-2, https://doi.org/10.1080/10412905.2002.9699741 . [all data]

Gallori, Flamini, et al., 2001
Gallori, S.; Flamini, G.; Bilia, A.R.; Morelli, I.; Landini, A.; Vincieri, F.F., Chemical composition of some traditional herbal drug preparations: essential oil and aromatic water of costmary (Balsamita suaveolens Pers.), J. Agric. Food Chem., 2001, 49, 12, 5907-5910, https://doi.org/10.1021/jf0107656 . [all data]

de Pooter, de Buyck, et al., 1989
de Pooter, H.L.; de Buyck, L.F.; Schamp, N.M.; Billiet, F.; De Bruyn, A., The volatile fraction of Otacanthus coeruleus Lindl. Containing the new copaene derivative β-copaen-4α-ol, Flavour Fragr. J., 1989, 4, 2, 47-51, https://doi.org/10.1002/ffj.2730040202 . [all data]