3,3-Dimethyl-2-norbornanone dimethyl ketal

Phase change data

Data compiled by: Hussein Y. Afeefy, Joel F. Liebman, and Stephen E. Stein

Quantity Value Units Method Reference Comment
Δvap13.94kcal/molEWiberg and Cunningham, 1990Heat of hydrolysis

Reaction thermochemistry data

Data compiled by: Hussein Y. Afeefy, Joel F. Liebman, and Stephen E. Stein

Individual Reactions

3,3-Dimethyl-2-norbornanone dimethyl ketal + Water = Bicyclo[2.2.1]heptan-2-one, 3,3-dimethyl- + 2Methyl Alcohol

By formula: C11H20O2 + H2O = C9H14O + 2CH4O

Quantity Value Units Method Reference Comment
Δr1.282 ± 0.063kcal/molCmWiberg and Cunningham, 1990liquid phase; Heat of hydrolysis

References

Wiberg and Cunningham, 1990
Wiberg, K.B.; Cunningham, W.C., Jr., Thermochemical studies of carbonyl reactions. 4. Enthalpies of hydrolysis of norbornyl ketals, J. Org. Chem., 1990, 55, 679-684. [all data]