Decane
- Formula: C10H22
- Molecular weight: 142.2817
- IUPAC Standard InChIKey: DIOQZVSQGTUSAI-UHFFFAOYSA-N
- CAS Registry Number: 124-18-5
- Chemical structure:

Reaction thermochemistry data

Data compiled by: Hussein Y. Afeefy, Joel F. Liebman, and Stephen E. Stein
Individual Reactions
By formula: H2 + C10H20 = C10H22
Quantity | Value | Units | Method | Reference | Comment |
---|---|---|---|---|---|
ΔrH° | -124.2 ± 1.2 | kJ/mol | Chyd | Rogers and Skanupong, 1974 | liquid phase; solvent: Hexane |
ΔrH° | -125.1 ± 1.3 | kJ/mol | Chyd | Bretschneider and Rogers, 1970 | liquid phase; solvent: galcial acetic acid |
By formula: 3H2 + C10H16 = C10H22
Quantity | Value | Units | Method | Reference | Comment |
---|---|---|---|---|---|
ΔrH° | -400. ± 2. | kJ/mol | Chyd | Skinner and Snelson, 1959 | liquid phase; solvent: Acetic acid |
By formula: 3H2 + C10H16 = C10H22
Quantity | Value | Units | Method | Reference | Comment |
---|---|---|---|---|---|
ΔrH° | -401.3 ± 0.8 | kJ/mol | Chyd | Skinner and Snelson, 1959 | liquid phase; solvent: Acetic acid |
By formula: H2 + C10H20 = C10H22
Quantity | Value | Units | Method | Reference | Comment |
---|---|---|---|---|---|
ΔrH° | -119.5 ± 1.5 | kJ/mol | Chyd | Rogers and Siddiqui, 1975 | liquid phase; solvent: n-Hexane |
By formula: 2H2 + C10H18 = C10H22
Quantity | Value | Units | Method | Reference | Comment |
---|---|---|---|---|---|
ΔrH° | -273.1 ± 2.1 | kJ/mol | Chyd | Rogers, Dagdagan, et al., 1979 | liquid phase; solvent: Hexane |
By formula: 2H2 + C10H18 = C10H22
Quantity | Value | Units | Method | Reference | Comment |
---|---|---|---|---|---|
ΔrH° | -271.4 ± 2.0 | kJ/mol | Chyd | Rogers, Dagdagan, et al., 1979 | liquid phase; solvent: Hexane |
By formula: 2H2 + C10H18 = C10H22
Quantity | Value | Units | Method | Reference | Comment |
---|---|---|---|---|---|
ΔrH° | -269.4 ± 1.7 | kJ/mol | Chyd | Rogers, Dagdagan, et al., 1979 | liquid phase; solvent: Hexane |
By formula: 2H2 + C10H18 = C10H22
Quantity | Value | Units | Method | Reference | Comment |
---|---|---|---|---|---|
ΔrH° | -268.2 ± 2.0 | kJ/mol | Chyd | Rogers, Dagdagan, et al., 1979 | liquid phase; solvent: Hexane |
By formula: 2H2 + C10H18 = C10H22
Quantity | Value | Units | Method | Reference | Comment |
---|---|---|---|---|---|
ΔrH° | -291.4 ± 2.1 | kJ/mol | Chyd | Rogers, Dagdagan, et al., 1979 | liquid phase; solvent: Hexane |

Gas phase ion energetics data

Data evaluated as indicated in comments:
L - Sharon G. Lias
Data compiled as indicated in comments:
LL - Sharon G. Lias and Joel F. Liebman
LBLHLM - Sharon G. Lias, John E. Bartmess, Joel F. Liebman, John L. Holmes, Rhoda D. Levin, and W. Gary Mallard
LLK - Sharon G. Lias, Rhoda D. Levin, and Sherif A. Kafafi
Quantity | Value | Units | Method | Reference | Comment |
---|---|---|---|---|---|
IE (evaluated) | 9.65 | eV | N/A | N/A | L |
Ionization energy determinations
IE (eV) | Method | Reference | Comment |
---|---|---|---|
9.73 | EST | Luo and Pacey, 1992 | LL |
9.65 ± 0.10 | EVAL | Lias, 1982 | LBLHLM |
9.54 ± 0.15 | EQ | Mautner(Meot-Ner), Sieck, et al., 1981 | LLK |

Lee's RI, non-polar column, temperature ramp

Column type | Active phase | I | Reference | Comment |
---|---|---|---|---|
Capillary | DB-5MS | 159.66 | Chen, Keeran, et al., 2002 | 30. m/0.25 mm/0.5 μm, 40. C @ 1. min, 10. K/min; Tend: 310. C |
Capillary | DB-5MS | 163.22 | Chen, Keeran, et al., 2002 | 30. m/0.25 mm/0.5 μm, 40. C @ 1. min, 4. K/min; Tend: 310. C |

Gas phase thermochemistry data

Data compiled as indicated in comments:
ALS - Hussein Y. Afeefy, Joel F. Liebman, and Stephen E. Stein
GT - Glushko Thermocenter, Russian Academy of Sciences, Moscow
Quantity | Value | Units | Method | Reference | Comment |
---|---|---|---|---|---|
ΔfH°gas | -59.67 ± 0.26 | kcal/mol | Ccb | Prosen and Rossini, 1945 | ALS |
Quantity | Value | Units | Method | Reference | Comment |
S°gas | 130.46 ± 0.26 | cal/mol*K | N/A | Scott D.W., 1974 | This reference does not contain the original experimental data. Experimental entropy value is based on the results [ Messerly J.F., 1967] for S(liquid).; GT |
Constant pressure heat capacity of gas
Cp,gas (cal/mol*K) | Temperature (K) | Reference | Comment |
---|---|---|---|
42.801 | 200. | Scott D.W., 1974, 2 | Recommended values were obtained from the consistent correlation scheme for alkanes [ Scott D.W., 1974, Scott D.W., 1974, 2]. This approach gives a good agreement with experimental data available for alkanes. However, large uncertainties could be expected at high temperatures.; GT |
52.079 | 273.15 | ||
55.7 ± 0.1 | 298.15 | ||
55.970 | 300. | ||
71.219 | 400. | ||
85.189 | 500. | ||
97.000 | 600. | ||
106.70 | 700. | ||
114.70 | 800. | ||
121.50 | 900. | ||
127.10 | 1000. | ||
131.90 | 1100. | ||
136.10 | 1200. | ||
140.00 | 1300. | ||
143.00 | 1400. | ||
146.00 | 1500. |

Condensed phase thermochemistry data

Data compiled as indicated in comments:
ALS - Hussein Y. Afeefy, Joel F. Liebman, and Stephen E. Stein
DH - Eugene S. Domalski and Elizabeth D. Hearing
Quantity | Value | Units | Method | Reference | Comment |
---|---|---|---|---|---|
ΔfH°liquid | -71.95 ± 0.26 | kcal/mol | Ccb | Prosen and Rossini, 1945 | ALS |
Quantity | Value | Units | Method | Reference | Comment |
ΔcH°liquid | -1620.06 ± 0.21 | kcal/mol | Ccb | Prosen and Rossini, 1945 | Corresponding ΔfHºliquid = -71.92 kcal/mol (simple calculation by NIST; no Washburn corrections); ALS |
ΔcH°liquid | -1620.13 ± 0.36 | kcal/mol | Ccb | Prosen and Rossini, 1944 | Corresponding ΔfHºliquid = -71.85 kcal/mol (simple calculation by NIST; no Washburn corrections); ALS |
ΔcH°liquid | -1619.1 | kcal/mol | Ccb | Jessup, 1937 | Corresponding ΔfHºliquid = -72.90 kcal/mol (simple calculation by NIST; no Washburn corrections); ALS |
Quantity | Value | Units | Method | Reference | Comment |
S°liquid | 101.79 | cal/mol*K | N/A | Finke, Gross, et al., 1954 | DH |
S°liquid | 102.5 | cal/mol*K | N/A | Huffman, Parks, et al., 1931 | Extrapolation below 90 K, 92.05 J/mol*K.; DH |
Constant pressure heat capacity of liquid
Cp,liquid (cal/mol*K) | Temperature (K) | Reference | Comment |
---|---|---|---|
75.155 | 298.9 | Czarnota, 1993 | p = 0.1 MPa.; DH |
77.407 | 318.15 | Banipal, Garg, et al., 1991 | T = 313 to 373 K. p = 0.1 MPa.; DH |
75.397 | 298.15 | Trejo, Costas, et al., 1991 | DH |
75.397 | 298.15 | Andreoli-Ball, Patterson, et al., 1988 | DH |
75.363 | 298.15 | Costas, Huu, et al., 1988 | DH |
75.29 | 298.23 | Kuznetsov, Kharin, et al., 1988 | T = 293 to 420 K. p = 0.1 MPa. Unsmoothed experimental datum given as 2.214 kJ/kg*K.; DH |
74.919 | 298.15 | Perez-Casas, Aicart, et al., 1988 | DH |
74.840 | 298.15 | Pintos, Bravo, et al., 1988 | DH |
75.397 | 298.15 | Wilhelm, Inglese, et al., 1987 | DH |
74.943 | 298.15 | Gates, Wood, et al., 1986 | T = 298.15 to 368.15 K.; DH |
75.397 | 298.15 | Tardajos, Aicart, et al., 1986 | DH |
74.866 | 298.15 | Baluja, Bravo, et al., 1985 | DH |
75.244 | 298.15 | Costas and Patterson, 1985 | T = 283.15, 298.15, 313.15 K.; DH |
74.806 | 298.15 | Lainez, Rodrigo, et al., 1985 | DH |
74.830 | 298.15 | Lainez, Roux-Desgranges, et al., 1985 | DH |
74.830 | 298.15 | Lainez, Wilhelm, et al., 1985 | DH |
75.031 | 298.15 | Grolier, Inglese, et al., 1984 | DH |
75.098 | 298.15 | Roux, Grolier, et al., 1984 | DH |
74.154 | 293.15 | Siddiqi, Svejda, et al., 1983 | DH |
74.69 | 298.15 | Wilhelm, Inglese, et al., 1982 | DH |
74.76 | 298. | Zaripov, 1982 | T = 298, 323, 363 K.; DH |
74.88 | 298.15 | Grolier, Hamedi, et al., 1979 | DH |
74.50 | 298. | Grigor'ev, Rastorguev, et al., 1975 | T = 300 to 463 K.; DH |
75.160 | 298.15 | Finke, Gross, et al., 1954 | T = 12 to 300 K.; DH |
74.639 | 299.8 | Schlinger and Sage, 1952 | T = 80 to 200°F.; DH |
75.041 | 298.15 | Osborne and Ginnings, 1947 | T = 278 to 318 K.; DH |
74.40 | 297.7 | Huffman, Parks, et al., 1931 | T = 91 to 298 K. Value is unsmoothed experimental datum.; DH |
74.00 | 295.5 | Parks, Huffman, et al., 1930 | T = 242 to 296 K. Value is unsmoothed experimental datum.; DH |

Phase change data

Data compiled as indicated in comments:
BS - Robert L. Brown and Stephen E. Stein
TRC - Thermodynamics Research Center, NIST Boulder Laboratories, Chris Muzny director
AC - William E. Acree, Jr., James S. Chickos
ALS - Hussein Y. Afeefy, Joel F. Liebman, and Stephen E. Stein
DH - Eugene S. Domalski and Elizabeth D. Hearing
CAL - James S. Chickos, William E. Acree, Jr., Joel F. Liebman, Students of Chem 202 (Introduction to the Literature of Chemistry), University of Missouri -- St. Louis
Quantity | Value | Units | Method | Reference | Comment |
---|---|---|---|---|---|
Tboil | 447.2 ± 0.3 | K | AVG | N/A | Average of 34 out of 43 values; Individual data points |
Quantity | Value | Units | Method | Reference | Comment |
Tfus | 243.3 ± 0.6 | K | AVG | N/A | Average of 23 out of 25 values; Individual data points |
Quantity | Value | Units | Method | Reference | Comment |
Ttriple | 243.4 ± 0.3 | K | AVG | N/A | Average of 9 values; Individual data points |
Quantity | Value | Units | Method | Reference | Comment |
Tc | 617.8 ± 0.7 | K | AVG | N/A | Average of 16 out of 18 values; Individual data points |
Quantity | Value | Units | Method | Reference | Comment |
Pc | 20.8 ± 0.8 | atm | AVG | N/A | Average of 11 values; Individual data points |
Quantity | Value | Units | Method | Reference | Comment |
Vc | 0.624 | l/mol | N/A | Ambrose and Tsonopoulos, 1995 | |
Quantity | Value | Units | Method | Reference | Comment |
ρc | 1.60 ± 0.05 | mol/l | N/A | Ambrose and Tsonopoulos, 1995 | |
ρc | 1.67 | mol/l | N/A | Steele, 1992 | Uncertainty assigned by TRC = 0.070 mol/l; TRC |
ρc | 1.60 | mol/l | N/A | Anselme, Gude, et al., 1990 | Uncertainty assigned by TRC = 0.04 mol/l; TRC |
ρc | 1.67 | mol/l | N/A | Knipmeyer, Archer, et al., 1989 | Uncertainty assigned by TRC = 0.070 mol/l; TRC |
ρc | 1.595 | mol/l | N/A | Gehrig and Lentz, 1983 | Uncertainty assigned by TRC = 0.04 mol/l; TRC |
Quantity | Value | Units | Method | Reference | Comment |
ΔvapH° | 12.27 ± 0.07 | kcal/mol | AVG | N/A | Average of 12 values; Individual data points |
Quantity | Value | Units | Method | Reference | Comment |
ΔsubH° | 19.2 | kcal/mol | B | Swain, Kwan, et al., 1980 | AC |
ΔsubH° | 19.7 | kcal/mol | H | Bondi, 1963 | See also Chickos, Hosseini, et al., 1993.; AC |
Enthalpy of vaporization
ΔvapH (kcal/mol) | Temperature (K) | Method | Reference | Comment |
---|---|---|---|---|
9.261 | 447.3 | N/A | Majer and Svoboda, 1985 | |
11.5 | 339. | GC | Mokbel, Razzouk, et al., 2007 | Based on data from 324. to 402. K.; AC |
11.1 | 352. | N/A | Batiu, 2002 | Based on data from 337. to 376. K.; AC |
12.3 | 299. | C | Viton, Chavret, et al., 1996 | AC |
12.1 | 314. | C | Viton, Chavret, et al., 1996 | AC |
12.0 | 324. | C | Viton, Chavret, et al., 1996 | AC |
11.8 | 334. | C | Viton, Chavret, et al., 1996 | AC |
10.2 | 424. | N/A | Lee, Dempsey, et al., 1992 | Based on data from 409. to 584. K.; AC |
11.5 | 340. | EB,IP | Chirico, Nguyen, et al., 1989 | Based on data from 268. to 490. K.; AC |
12.9 | 267. | A | Stephenson and Malanowski, 1987 | Based on data from 252. to 383. K.; AC |
9.97 | 462. | A | Stephenson and Malanowski, 1987 | Based on data from 447. to 526. K.; AC |
9.23 | 539. | A | Stephenson and Malanowski, 1987 | Based on data from 524. to 617. K.; AC |
10.8 | 388. | N/A | Stephenson and Malanowski, 1987 | Based on data from 373. to 443. K. See also Varushchenko, Belikova, et al., 1970.; AC |
12.0 | 313. | GS | Allemand, Jose, et al., 1986 | Based on data from 298. to 347. K.; AC |
11.9 ± 0.41 | 308. to 351. | N/A | Beckhaus, Ruchardt, et al., 1984 | AC |
13.4 | 258. | N/A | Carruth and Kobayashi, 1973 | Based on data from 243. to 310. K.; AC |
10.9 | 383. | MM | Willingham, Taylor, et al., 1945 | Based on data from 368. to 440. K.; AC |
Enthalpy of vaporization
ΔvapH =
A exp(-βTr) (1 − Tr)β
ΔvapH =
Enthalpy of vaporization (at saturation pressure)
(kcal/mol)
Tr = reduced temperature (T / Tc)
View plot Requires a JavaScript / HTML 5 canvas capable browser.
Temperature (K) | A (kcal/mol) | β | Tc (K) | Reference | Comment |
---|---|---|---|---|---|
298. to 444. | 17.78 | 0.3238 | 617.4 | Majer and Svoboda, 1985 |
Antoine Equation Parameters
log10(P) = A − (B / (T + C))
P = vapor pressure (atm)
T = temperature (K)
View plot Requires a JavaScript / HTML 5 canvas capable browser.
Temperature (K) | A | B | C | Reference | Comment |
---|---|---|---|---|---|
243.49 to 310.59 | 0.20450 | 440.616 | -156.896 | Carruth and Kobayashi, 1973 | Coefficents calculated by NIST from author's data. |
367.63 to 448.27 | 4.07286 | 1501.268 | -78.67 | Williamham, Taylor, et al., 1945 |
Enthalpy of sublimation
ΔsubH (kcal/mol) | Temperature (K) | Method | Reference | Comment |
---|---|---|---|---|
20.3 | 243. | B | Bondi, 1963 | AC |
Enthalpy of fusion
ΔfusH (kcal/mol) | Temperature (K) | Method | Reference | Comment |
---|---|---|---|---|
6.8631 | 243.51 | N/A | Finke, Gross, et al., 1954 | DH |
6.60 | 243. | DSC | Marti, Kaisersberger, et al., 2004 | AC |
6.86 | 243.5 | N/A | Domalski and Hearing, 1996 | AC |
6.8781 | 243.1 | N/A | Huffman, Parks, et al., 1931 | DH |
Entropy of fusion
ΔfusS (cal/mol*K) | Temperature (K) | Reference | Comment |
---|---|---|---|
28.184 | 243.51 | Finke, Gross, et al., 1954 | DH |
28.200 | 243.5 | Domalski and Hearing, 1996 | CAL |
28.30 | 243.1 | Huffman, Parks, et al., 1931 | DH |

Henry's Law data

Data compiled by: Rolf Sander
Henry's Law constant (water solution)
kH(T) = k°H exp(d(ln(kH))/d(1/T) ((1/T) - 1/(298.15 K)))
k°H = Henry's law constant for solubility in water at 298.15 K (mol/(kg*bar))
d(ln(kH))/d(1/T) = Temperature dependence constant (K)
k°H (mol/(kg*bar)) | d(ln(kH))/d(1/T) (K) | Method | Reference | Comment |
---|---|---|---|---|
0.00021 | Q | N/A | missing citation give several references for the Henry's law constants but don't assign them to specific species. | |
0.00014 | L | N/A |

References

Rogers and Skanupong, 1974
Rogers, D.W.; Skanupong, S.,
Heats of hydrogenation of sixteen terminal monoolefins. The alternating effect,
J. Phys. Chem., 1974, 78, 2569-2572. [all data]
Bretschneider and Rogers, 1970
Bretschneider, E.; Rogers, D.W.,
A new microcalorimeter: heats of hydrogenation of four monoolefins,
Mikrochim. Acta, 1970, 482-490. [all data]
Skinner and Snelson, 1959
Skinner, H.A.; Snelson, A.,
Heats of hydrogenation Part 3.,
Trans. Faraday Soc., 1959, 55, 405-407. [all data]
Rogers and Siddiqui, 1975
Rogers, D.W.; Siddiqui, N.A.,
Heats of hydrogenation of large molecules. I. Esters of unsaturated fatty acids,
J. Phys. Chem., 1975, 79, 574-577. [all data]
Rogers, Dagdagan, et al., 1979
Rogers, D.W.; Dagdagan, O.A.; Allinger, N.L.,
Heats of hydrogenation and formation of linear alkynes and a molecular mechanics interpretation,
J. Am. Chem. Soc., 1979, 101, 671-676. [all data]
Luo and Pacey, 1992
Luo, Y.-R.; Pacey, P.D.,
Effects of alkyl substitution on ionization energies of alkanes and haloalkanes and on heats of formation of their molecular cations. Part 2. Alkanes and chloro-, bromo- and iodoalkanes,
Int. J. Mass Spectrom. Ion Processes, 1992, 112, 63. [all data]
Lias, 1982
Lias, S.G.,
Thermochemical information from ion-molecule rate constants,
Ion Cyclotron Reson. Spectrom. 1982, 1982, 409. [all data]
Mautner(Meot-Ner), Sieck, et al., 1981
Mautner(Meot-Ner), M.; Sieck, L.W.; Ausloos, P.,
Ionization of normal alkanes: Enthalpy, entropy, structural, and isotope effects,
J. Am. Chem. Soc., 1981, 103, 5342. [all data]
Chen, Keeran, et al., 2002
Chen, P.H.; Keeran, W.S.; Van Ausdale, W.A.; Schindler, D.R.; Roberts, D.W.,
Application of Lee retention indices to the confirmation of tentatively identified compounds from GC/MS analysis of environmental samples, Technical paper, Analytical Services Division, Environmental ScienceEngineering, Inc, PO Box 1703, Gainesville, FL 32602, 2002, 11. [all data]