Dimolybdenum hexaoxide

Gas phase ion energetics data

Data compiled as indicated in comments:
RDSH - Henry M. Rosenstock, Keith Draxl, Bruce W. Steiner, and John T. Herron

Ionization energy determinations

IE (eV) Method Reference Comment
12.1 ± 0.6EIBurns, DeMaria, et al., 1960RDSH

Appearance energy determinations

Ion AE (eV) Other Products MethodReferenceComment
Mo2O5+14.5OEIBurns, DeMaria, et al., 1960RDSH

References

Burns, DeMaria, et al., 1960
Burns, R.P.; DeMaria, G.; Drowart, J.; Grimley, R.T., Mass spectrometric investigation of the sublimation of molybdenum dioxide, J. Chem. Phys., 1960, 32, 1363. [all data]