Octadecanoic acid, 2,3-dihydroxypropyl ester

Condensed phase thermochemistry data

Data compiled as indicated in comments:
ALS - Hussein Y. Afeefy, Joel F. Liebman, and Stephen E. Stein
DH - Eugene S. Domalski and Elizabeth D. Hearing

Quantity Value Units Method Reference Comment
Δfsolid-319.75 ± 0.52kcal/molCcbSilbert, Daubert, et al., 1965ALS
Quantity Value Units Method Reference Comment
Δcsolid-3090.05 ± 0.42kcal/molCcbSilbert, Daubert, et al., 1965Corresponding Δfsolid = -319.64 kcal/mol (simple calculation by NIST; no Washburn corrections); ALS

Constant pressure heat capacity of solid

Cp,solid (cal/mol*K) Temperature (K) Reference Comment
145.9298.Silbert, Daubert, et al., 1965BL-form.; DH
207.0298.2Ward, Vicknair, et al., 1955crystaline, α phase; T = -74 to 114°C. Give experimental points and equations for solid and liquid states. Sub-alpha form, Cp = 0.4977 + 0.00318t cal/g*K, -13 to 40°C; liquid, Cp = 0.5118 + 0.00182t cal/g*K, 87 to 100°C.; DH

References

Silbert, Daubert, et al., 1965
Silbert, L.S.; Daubert, B.F.; Mason, L.S., The heats of combustion, formation, and isomerization of isomeric monoglycerides, J. Phys. Chem., 1965, 69, 2887-2894. [all data]

Ward, Vicknair, et al., 1955
Ward, T.L.; Vicknair, E.J.; Singleton, W.S.; Feuge, R.O., Some thermal properties of 1-monostearin, 1-aceto-3-stearin and 1,2-diaceto-3-stearin, J. Phys. Chem., 1955, 59, 4-7. [all data]