Tuaminoheptane

Normal alkane RI, non-polar column, isothermal

Data compiled by: NIST Mass Spectrometry Data Center, William E. Wallace, director

Column type CapillaryCapillaryCapillary
Active phase Apieson L / KOHApieson L / KOHApieson L / KOH
Column length (m)
Carrier gas
Substrate
Column diameter (mm)
Phase thickness (μm)
Temperature (C) 150.150.150.
I 802.807.810.
ReferenceCaddy, Fish, et al., 1973Caddy, Fish, et al., 1973Caddy, Fish, et al., 1973
Comment MSDC-RI MSDC-RI MSDC-RI

References

Caddy, Fish, et al., 1973
Caddy, B.; Fish, F.; Scott, D., Chromatographic screening for drugs of abuse using capillary columds. II. Peak identification on support coated open tubular columns for a series of central nervous system stimulating drugs, Chromatographia, 1973, 6, 7, 293-300, https://doi.org/10.1007/BF02269329 . [all data]