Dilithium dibromide

Gas phase ion energetics data

Data compiled as indicated in comments:
LLK - Sharon G. Lias, Rhoda D. Levin, and Sherif A. Kafafi
RDSH - Henry M. Rosenstock, Keith Draxl, Bruce W. Steiner, and John T. Herron

Ionization energy determinations

IE (eV) Method Reference Comment
9.4EIBerkowitz, Tasman, et al., 1962RDSH
10.05 ± 0.08PEPotts and Lee, 1979Vertical value; LLK

References

Berkowitz, Tasman, et al., 1962
Berkowitz, J.; Tasman, H.A.; Chupka, W.A., Double-oven experiments with lithium halide vapors, J. Chem. Phys., 1962, 36, 2170. [all data]

Potts and Lee, 1979
Potts, A.W.; Lee, E.P.F., Photoelectron spectra and electronic structure of lithium halide monomers and dimers, J. Chem. Soc. Faraday Trans. 2, 1979, 75, 941. [all data]