C5H11N3O2S

Reaction thermochemistry data

Data compiled by: John E. Bartmess

Individual Reactions

C5H10N3O2S + Hydrogen cation = C5H11N3O2S

By formula: C5H10N3O2S + H+ = C5H11N3O2S

Quantity Value Units Method Reference Comment
Δr335.3 ± 1.8kcal/molCIDCShen and Ren, 2012gas phase
Quantity Value Units Method Reference Comment
Δr327.1 ± 1.8kcal/molCIDCShen and Ren, 2012gas phase

Gas phase ion energetics data

Data compiled by: John E. Bartmess

De-protonation reactions

C5H10N3O2S + Hydrogen cation = C5H11N3O2S

By formula: C5H10N3O2S + H+ = C5H11N3O2S

Quantity Value Units Method Reference Comment
Δr335.3 ± 1.8kcal/molCIDCShen and Ren, 2012gas phase
Quantity Value Units Method Reference Comment
Δr327.1 ± 1.8kcal/molCIDCShen and Ren, 2012gas phase

References

Shen and Ren, 2012
Shen, J.L.; Ren, J.H., Gas phase acidity of a cysteine residue in small oligopeptides, Int. J. Mass Spectrom., 2012, 316, 147-156, https://doi.org/10.1016/j.ijms.2012.01.001 . [all data]