Zirconium, tetrakis(tetrahydroborato)-

Gas phase ion energetics data

Data compiled as indicated in comments:
LBLHLM - Sharon G. Lias, John E. Bartmess, Joel F. Liebman, John L. Holmes, Rhoda D. Levin, and W. Gary Mallard
LLK - Sharon G. Lias, Rhoda D. Levin, and Sherif A. Kafafi

Ionization energy determinations

IE (eV) Method Reference Comment
10.6PEHitchcock, Hao, et al., 1982LBLHLM
11.2PEHitchcock, Hao, et al., 1982Vertical value; LBLHLM
11.6 ± 0.1PEDowns, Egdell, et al., 1978Vertical value; LLK

References

Hitchcock, Hao, et al., 1982
Hitchcock, A.P.; Hao, N.; Werstiuk, N.H.; McGlinchey, M.J.; Ziegler, T., Electronic structure of Zr(BH4)4 and Hf(BH4)4 studied by photoelectron spectroscopy and LCAO-HFS calculations, Inorg. Chem., 1982, 21, 793. [all data]

Downs, Egdell, et al., 1978
Downs, A.J.; Egdell, R.G.; Orchard, A.F.; Thomas, P.D.P., Photoelectron spectra of metal tetrahydroborates, J. Chem. Soc. Dalton Trans., 1978, 12, 1755. [all data]