Triaquo hexacetate chromate chloride hexahydrate

Condensed phase thermochemistry data

Data compiled by: Eugene S. Domalski and Elizabeth D. Hearing

Constant pressure heat capacity of solid

Cp,solid (J/mol*K) Temperature (K) Reference Comment
958.02278.084Sorai, Tachiki, et al., 1971T = 1.5 to 280 K. Value is unsmoothed experimental datum.

References

Sorai, Tachiki, et al., 1971
Sorai, M.; Tachiki, M.; Suga, H.; Seki, S., Magnetic and thermal properties of crystals including isolated clusters. I. Heat capacity and infrared spectrum of [Cr3O(CH3COO)6(H2O)3]Clx6H2O crystal between 1.5 and 280K, J. Phys. Soc. Japan, 1971, 30, 750-759. [all data]