tris(1,1,1,5,5,5-hexafluoro-2,4-pentanedionato)californium-dipropyl sulfoxide (1:2) complex

Phase change data

Data compiled by: William E. Acree, Jr., James S. Chickos

Enthalpy of sublimation

ΔsubH (kJ/mol) Temperature (K) Method Reference
93.6 ± 6.0402. - 434.GS,TRMAizenberg, Fedoseev, et al., 1989

References

Aizenberg, Fedoseev, et al., 1989
Aizenberg, M.I.; Fedoseev, E.V.; Travnikov, S.S.; Davydov, A.V.; Myasoedov, B.F., Determination of the vapour pressure temperature dependence of californium hexafluoroacetylacetonate adducts, Journal of Radioanalytical and Nuclear Chemistry Letters, 1989, 136, 6, 405-409, https://doi.org/10.1007/BF02164717 . [all data]