Trilead trioxide

Gas phase ion energetics data

Data compiled by: Henry M. Rosenstock, Keith Draxl, Bruce W. Steiner, and John T. Herron

Ionization energy determinations

IE (eV) Method Reference
9.7 ± 1.0EIDrowart, Colin, et al., 1965

Appearance energy determinations

Ion AE (eV) Other Products MethodReferenceComment
Pb3O2+14.6 ± 1.0OEIDrowart, Colin, et al., 1965

References

Drowart, Colin, et al., 1965
Drowart, J.; Colin, R.; Exsteen, G., Mass spectrometric study of the vaporization of lead monoxide. Dissociation energy of PbO, J. Chem. Soc. Faraday Trans., 1965, 61, 1376. [all data]