Methyl dehydroabietate

Normal alkane RI, non-polar column, custom temperature program

Data compiled by: NIST Mass Spectrometry Data Center, William E. Wallace, director

Column type CapillaryCapillary
Active phase RTX-5 MSHP-5
Column length (m) 15.30.
Carrier gas HeliumHelium
Substrate
Column diameter (mm) 0.250.25
Phase thickness (μm) 0.250.25
Program 35 0C (6 min) 5 0C/min -> 150 0C 10 0C/min -> 280 0C (3 min)not specified
I 2361.2335.
ReferenceNadaf, Halimi, et al., 2012Isidorov, Lech, et al., 2008
Comment MSDC-RI MSDC-RI

Van Den Dool and Kratz RI, non-polar column, custom temperature program

Data compiled by: NIST Mass Spectrometry Data Center, William E. Wallace, director

Column type Capillary
Active phase HP-5MS
Column length (m) 30.
Carrier gas He
Substrate
Column diameter (mm) 0.25
Phase thickness (μm) 0.25
Program 60C (1 min) => 5 C/min => 210C => 10 C/min => 280C (15 min)
I 2354.5
ReferenceAndriamaharavo, 2014
Comment MSDC-RI

Phase change data

Data compiled by: Robert L. Brown and Stephen E. Stein

Quantity Value Units Method Reference Comment
Tfus335. - 336.KN/ABuckingham and Donaghy, 1982

Reduced pressure boiling point

Tboil (K) Pressure (bar) Reference
425. - 427.0.0003Buckingham and Donaghy, 1982

Lee's RI, non-polar column, temperature ramp

Data compiled by: NIST Mass Spectrometry Data Center, William E. Wallace, director

Column type CapillaryCapillary
Active phase DB-1DB-1
Column length (m) 30.30.
Carrier gas
Substrate
Column diameter (mm) 0.20.2
Phase thickness (μm) 0.250.25
Tstart (C) 50.50.
Tend (C) 300.300.
Heat rate (K/min) 5.5.
Initial hold (min) 2.2.
Final hold (min) 5.5.
I 388.3388.3
ReferenceJohnson, Urso, et al., 1997Johnson, Urso, et al., 1997
Comment MSDC-RI MSDC-RI

References

Nadaf, Halimi, et al., 2012
Nadaf, M.; Halimi, M.; Mortazavi, M., Identification of nonpolar chemical composition Spartium junceum flower growing in Iran by GC-MS, Middle-East J. Sci. Res., 2012, 11, 2, 221-224. [all data]

Isidorov, Lech, et al., 2008
Isidorov, V.A.; Lech, P.; Zolciak, A.; Rusak, N.; Szczepaniak, L., Gas Chromatographic - nass spectrometric investigation of metabolites from the needles and roots of pine seedlings at early stages of pathogenic fungi Armillaria ostoyae attack, Trees, 2008, 22, 4, 531-542, https://doi.org/10.1007/s00468-008-0213-z . [all data]