Carbon monosulfide, positive ion

Ion clustering data

Data compiled by: Michael M. Meot-Ner (Mautner) and Sharon G. Lias

Clustering reactions

CS+ + Carbon disulfide = (CS+ • Carbon disulfide)

By formula: CS+ + CS2 = (CS+ • CS2)

Quantity Value Units Method Reference Comment
Δr151.kJ/molPIOno, Linn, et al., 1981gas phase

Reaction thermochemistry data

Data compiled by: Michael M. Meot-Ner (Mautner) and Sharon G. Lias

Individual Reactions

CS+ + Carbon disulfide = (CS+ • Carbon disulfide)

By formula: CS+ + CS2 = (CS+ • CS2)

Quantity Value Units Method Reference Comment
Δr36.0kcal/molPIOno, Linn, et al., 1981gas phase

References

Ono, Linn, et al., 1981
Ono, Y.; Linn, S.H.; Prest, H.F.; Gress, M.E.; Ng, C.Y., A Study of the High Rydberg State and Ion - Molecule Reactions of Carbon Disulfide Using the Molecular Beam Photoionization Method, J. Chem. Phys., 1981, 74, 2, 1125, https://doi.org/10.1063/1.441219 . [all data]