CHN2

Gas phase ion energetics data

Data compiled by: John E. Bartmess

De-protonation reactions

CN2- + Hydrogen cation = CHN2

By formula: CN2- + H+ = CHN2

Quantity Value Units Method Reference Comment
Δr1473. ± 18.kJ/molG+TSClifford, Wenthold, et al., 1998gas phase; between pyrazole, tBuSH
Quantity Value Units Method Reference Comment
Δr1441. ± 17.kJ/molIMRBClifford, Wenthold, et al., 1998gas phase; between pyrazole, tBuSH

Reaction thermochemistry data

Data compiled by: John E. Bartmess

Individual Reactions

CN2- + Hydrogen cation = CHN2

By formula: CN2- + H+ = CHN2

Quantity Value Units Method Reference Comment
Δr352.0 ± 4.3kcal/molG+TSClifford, Wenthold, et al., 1998gas phase; between pyrazole, tBuSH
Quantity Value Units Method Reference Comment
Δr344.3 ± 4.0kcal/molIMRBClifford, Wenthold, et al., 1998gas phase; between pyrazole, tBuSH

Vibrational and/or electronic energy levels

Data compiled by: Marilyn E. Jacox

State:   C

 Energy
 (cm-1
 Med.   Transition   λmin
 (nm)
 λmax
 (nm)

References

Clifford, Wenthold, et al., 1998
Clifford, E.P.; Wenthold, P.G.; Lineberger, W.C.; Peterssom, G.A.; Broaddus, K.M.; Kass, S.R.; Kato, S., Properties of Diazocarbene [CNN] and the diazomethyl Radical [HCNN] via Ion Chemistry and Spectroscopy, J. Phys. Chem. A, 1998, 102, 36, 7100, https://doi.org/10.1021/jp9802735 . [all data]