Digermanium tetrafluoride

Gas phase ion energetics data

Data compiled as indicated in comments:
LLK - Sharon G. Lias, Rhoda D. Levin, and Sherif A. Kafafi
RDSH - Henry M. Rosenstock, Keith Draxl, Bruce W. Steiner, and John T. Herron

Ionization energy determinations

IE (eV) Method Reference Comment
13.1 ± 0.3EIAdams, Margrave, et al., 1971LLK
10.6 ± 0.3EIZmbov, Hastie, et al., 1968RDSH

References

Adams, Margrave, et al., 1971
Adams, G.P.; Margrave, J.L.; Steiger, R.P.; Wilson, P.W., The enthalpy of sublimation of germanium difluoride and the thermodynamics of sublimation of the Group IVa difluorides, J. Chem. Thermodyn., 1971, 3, 297. [all data]

Zmbov, Hastie, et al., 1968
Zmbov, K.F.; Hastie, J.W.; Hauge, R.; Margrave, J.L., Formation of polymeric (GeF2)n in the vapor phase over GeF2, Inorg. Chem., 1968, 7, 608. [all data]