D-Homoestra-1,3,5(10),6,8-pentaen-17a-one,3-methoxy-

Gas phase ion energetics data

Data compiled by: Sharon G. Lias, Rhoda D. Levin, and Sherif A. Kafafi

Ionization energy determinations

IE (eV) Method Reference
7.56 ± 0.07EIZaretskii, Sadovskaya, et al., 1971

Appearance energy determinations

Ion AE (eV) Other Products MethodReferenceComment
C15H15O+11.46 ± 0.05?EIZaretskii, Sadovskaya, et al., 1971
C16H16O+10.79 ± 0.07?EIZaretskii, Sadovskaya, et al., 1971

References

Zaretskii, Sadovskaya, et al., 1971
Zaretskii, V.I.; Sadovskaya, V.L.; Wulfson, N.S.; Sizoy, V.F.; Merimson, V.G., Mass spectrometry of steroid systems-XXI. Appearance and ionization potentials for the stereoisomers of the D-homoestrane series, Org. Mass Spectrom., 1971, 5, 1179. [all data]