Disilicon tricarbide

Gas phase ion energetics data

Data compiled by: Henry M. Rosenstock, Keith Draxl, Bruce W. Steiner, and John T. Herron

Ionization energy determinations

IE (eV) Method Reference
9.2 ± 0.3EIDrowart, DeMaria, et al., 1958

References

Drowart, DeMaria, et al., 1958
Drowart, J.; DeMaria, G.; Inghram, M.G., Thermodynamic study of SiC utilizing a mass spectrometer, J. Chem. Phys., 1958, 29, 1015. [all data]